Reaction Details
TargetCarbonic anhydrase 9
LigandBDBM50387129
Substrate/Competitorn/a
Meas. Tech.ChEMBL_946060 (CHEMBL2342097)
Ki 9±n/a nM
Citation Tarko, LSupuran, CT QSAR studies of sulfamate and sulfamide inhibitors targeting human carbonic anhydrase isozymes I, II, IX and XII. Bioorg Med Chem21:1404-9 (2013) 
 
Carbonic anhydrase 9
Name:Carbonic anhydrase 9
Type:Enzyme
Mol. Mass.:49669.03
Organism:Homo sapiens (Human)
Description:Catalytic domain of human cloned isozyme was used in the assay
Residue:459
BDBM50387129
NameBDBM50387129
Synonyms:4-ureidophenyl sulfamate ring derivative 3n | CHEMBL2047809
TypeSmall organic molecule
Emp. Form.C15H18N4O4S
Mol. Mass.350.393
SMILESCN(C)c1ccc(NC(=O)Nc2ccc(OS(N)(=O)=O)cc2)cc1