Reaction Details
TargetCarbonic anhydrase 2
LigandBDBM50428615
Substrate/Competitorn/a
Meas. Tech.ChEMBL_946061 (CHEMBL2342098)
Ki 342±n/a nM
Citation Tarko, LSupuran, CT QSAR studies of sulfamate and sulfamide inhibitors targeting human carbonic anhydrase isozymes I, II, IX and XII. Bioorg Med Chem21:1404-9 (2013) 
 
Carbonic anhydrase 2
Name:Carbonic anhydrase 2
Type:Enzyme
Mol. Mass.:29250.71
Organism:Homo sapiens (Human)
Description:P00918
Residue:260
BDBM50428615
NameBDBM50428615
Synonyms:CHEMBL2331759
TypeSmall organic molecule
Emp. Form.C13H20N4O3S
Mol. Mass.312.388
SMILESNS(=O)(=O)Nc1ccc(NC(=O)NC2CCCCC2)cc1