Reaction Details
TargetCarbonic anhydrase 2
LigandBDBM50428616
Substrate/Competitorn/a
Meas. Tech.ChEMBL_946061 (CHEMBL2342098)
Ki 430±n/a nM
Citation Tarko, LSupuran, CT QSAR studies of sulfamate and sulfamide inhibitors targeting human carbonic anhydrase isozymes I, II, IX and XII. Bioorg Med Chem21:1404-9 (2013) 
 
Carbonic anhydrase 2
Name:Carbonic anhydrase 2
Type:Enzyme
Mol. Mass.:29250.71
Organism:Homo sapiens (Human)
Description:P00918
Residue:260
BDBM50428616
NameBDBM50428616
Synonyms:CHEMBL2331758
TypeSmall organic molecule
Emp. Form.C15H18N4O5S
Mol. Mass.366.392
SMILESCOc1ccc(OC)c(NC(=O)Nc2ccc(NS(N)(=O)=O)cc2)c1