Reaction Details
TargetCarbonic anhydrase 2
LigandBDBM50428617
Substrate/Competitorn/a
Meas. Tech.ChEMBL_946061 (CHEMBL2342098)
Ki 430±n/a nM
Citation Tarko, LSupuran, CT QSAR studies of sulfamate and sulfamide inhibitors targeting human carbonic anhydrase isozymes I, II, IX and XII. Bioorg Med Chem21:1404-9 (2013) 
 
Carbonic anhydrase 2
Name:Carbonic anhydrase 2
Type:Enzyme
Mol. Mass.:29250.71
Organism:Homo sapiens (Human)
Description:P00918
Residue:260
BDBM50428617
NameBDBM50428617
Synonyms:CHEMBL2331757
TypeSmall organic molecule
Emp. Form.C19H20N4O3S
Mol. Mass.384.452
SMILESCC(NC(=O)Nc1ccc(NS(N)(=O)=O)cc1)c1cccc2ccccc12