Reaction Details
TargetCarbonic anhydrase 2
LigandBDBM50387133
Substrate/Competitorn/a
Meas. Tech.ChEMBL_946061 (CHEMBL2342098)
Ki 271±n/a nM
Citation Tarko, LSupuran, CT QSAR studies of sulfamate and sulfamide inhibitors targeting human carbonic anhydrase isozymes I, II, IX and XII. Bioorg Med Chem21:1404-9 (2013) 
 
Carbonic anhydrase 2
Name:Carbonic anhydrase 2
Type:Enzyme
Mol. Mass.:29250.71
Organism:Homo sapiens (Human)
Description:P00918
Residue:260
BDBM50387133
NameBDBM50387133
Synonyms:CHEMBL2047813
TypeSmall organic molecule
Emp. Form.C17H15N3O4S
Mol. Mass.357.384
SMILESNS(=O)(=O)Oc1ccc(NC(=O)Nc2cccc3ccccc23)cc1