Reaction Details
TargetCarbonic anhydrase 2
LigandBDBM50387120
Substrate/Competitorn/a
Meas. Tech.ChEMBL_946061 (CHEMBL2342098)
Ki 342±n/a nM
Citation Tarko, LSupuran, CT QSAR studies of sulfamate and sulfamide inhibitors targeting human carbonic anhydrase isozymes I, II, IX and XII. Bioorg Med Chem21:1404-9 (2013) 
 
Carbonic anhydrase 2
Name:Carbonic anhydrase 2
Type:Enzyme
Mol. Mass.:29250.71
Organism:Homo sapiens (Human)
Description:P00918
Residue:260
BDBM50387120
NameBDBM50387120
Synonyms:4-ureidophenyl sulfamate ring derivative 3d | CHEMBL2047799
TypeSmall organic molecule
Emp. Form.C13H12BrN3O4S
Mol. Mass.386.221
SMILESNS(=O)(=O)Oc1ccc(NC(=O)Nc2ccc(Br)cc2)cc1