Reaction Details
TargetCarbonic anhydrase 2
LigandBDBM50387115
Substrate/Competitorn/a
Meas. Tech.ChEMBL_946061 (CHEMBL2342098)
Ki 271±n/a nM
Citation Tarko, LSupuran, CT QSAR studies of sulfamate and sulfamide inhibitors targeting human carbonic anhydrase isozymes I, II, IX and XII. Bioorg Med Chem21:1404-9 (2013) 
 
Carbonic anhydrase 2
Name:Carbonic anhydrase 2
Type:Enzyme
Mol. Mass.:29250.71
Organism:Homo sapiens (Human)
Description:P00918
Residue:260
BDBM50387115
NameBDBM50387115
Synonyms:CHEMBL2047797
TypeSmall organic molecule
Emp. Form.C13H12FN3O4S
Mol. Mass.325.315
SMILESNS(=O)(=O)Oc1ccc(NC(=O)Nc2ccc(F)cc2)cc1