Reaction Details
TargetCarbonic anhydrase 1
LigandBDBM50428615
Substrate/Competitorn/a
Meas. Tech.ChEMBL_946062 (CHEMBL2342099)
Ki 4300±n/a nM
Citation Tarko, LSupuran, CT QSAR studies of sulfamate and sulfamide inhibitors targeting human carbonic anhydrase isozymes I, II, IX and XII. Bioorg Med Chem21:1404-9 (2013) 
 
Carbonic anhydrase 1
Name:Carbonic anhydrase 1
Type:Enzyme
Mol. Mass.:28873.37
Organism:Homo sapiens (Human)
Description:P00915
Residue:261
BDBM50428615
NameBDBM50428615
Synonyms:CHEMBL2331759
TypeSmall organic molecule
Emp. Form.C13H20N4O3S
Mol. Mass.312.388
SMILESNS(=O)(=O)Nc1ccc(NC(=O)NC2CCCCC2)cc1