Reaction Details
TargetCarbonic anhydrase 1
LigandBDBM50428618
Substrate/Competitorn/a
Meas. Tech.ChEMBL_946062 (CHEMBL2342099)
Ki 6660±n/a nM
Citation Tarko, LSupuran, CT QSAR studies of sulfamate and sulfamide inhibitors targeting human carbonic anhydrase isozymes I, II, IX and XII. Bioorg Med Chem21:1404-9 (2013) 
 
Carbonic anhydrase 1
Name:Carbonic anhydrase 1
Type:Enzyme
Mol. Mass.:28873.37
Organism:Homo sapiens (Human)
Description:P00915
Residue:261
BDBM50428618
NameBDBM50428618
Synonyms:CHEMBL2331756
TypeSmall organic molecule
Emp. Form.C12H14N4O4S
Mol. Mass.310.329
SMILESNS(=O)(=O)Nc1ccc(NC(=O)NCc2ccco2)cc1