Reaction Details
TargetCarbonic anhydrase 1
LigandBDBM50428619
Substrate/Competitorn/a
Meas. Tech.ChEMBL_946062 (CHEMBL2342099)
Ki 8346±n/a nM
Citation Tarko, LSupuran, CT QSAR studies of sulfamate and sulfamide inhibitors targeting human carbonic anhydrase isozymes I, II, IX and XII. Bioorg Med Chem21:1404-9 (2013) 
 
Carbonic anhydrase 1
Name:Carbonic anhydrase 1
Type:Enzyme
Mol. Mass.:28873.37
Organism:Homo sapiens (Human)
Description:P00915
Residue:261
BDBM50428619
NameBDBM50428619
Synonyms:CHEMBL2331755
TypeSmall organic molecule
Emp. Form.C16H20N4O3S
Mol. Mass.348.42
SMILESCC(C)c1ccccc1NC(=O)Nc1ccc(NS(N)(=O)=O)cc1