Reaction Details
TargetCarbonic anhydrase 1
LigandBDBM50387157
Substrate/Competitorn/a
Meas. Tech.ChEMBL_946062 (CHEMBL2342099)
Ki 3416±n/a nM
Citation Tarko, LSupuran, CT QSAR studies of sulfamate and sulfamide inhibitors targeting human carbonic anhydrase isozymes I, II, IX and XII. Bioorg Med Chem21:1404-9 (2013) 
 
Carbonic anhydrase 1
Name:Carbonic anhydrase 1
Type:Enzyme
Mol. Mass.:28873.37
Organism:Homo sapiens (Human)
Description:P00915
Residue:261
BDBM50387157
NameBDBM50387157
Synonyms:4-ureidophenyl sulfamate ring derivative 3az | CHEMBL2047842
TypeSmall organic molecule
Emp. Form.C15H15N3O6S
Mol. Mass.365.361
SMILESNS(=O)(=O)Oc1ccc(NC(=O)Nc2ccc3OCCOc3c2)cc1