Reaction Details
TargetCarbonic anhydrase 1
LigandBDBM50387160
Substrate/Competitorn/a
Meas. Tech.ChEMBL_946062 (CHEMBL2342099)
Ki 4300±n/a nM
Citation Tarko, LSupuran, CT QSAR studies of sulfamate and sulfamide inhibitors targeting human carbonic anhydrase isozymes I, II, IX and XII. Bioorg Med Chem21:1404-9 (2013) 
 
Carbonic anhydrase 1
Name:Carbonic anhydrase 1
Type:Enzyme
Mol. Mass.:28873.37
Organism:Homo sapiens (Human)
Description:P00915
Residue:261
BDBM50387160
NameBDBM50387160
Synonyms:4-ureidophenyl sulfamate ring derivative 3ay | CHEMBL2047841
TypeSmall organic molecule
Emp. Form.C13H15N3O4S2
Mol. Mass.341.406
SMILESNS(=O)(=O)Oc1ccc(NC(=O)NCCc2cccs2)cc1