Reaction Details
TargetCarbonic anhydrase 1
LigandBDBM50387152
Substrate/Competitorn/a
Meas. Tech.ChEMBL_946062 (CHEMBL2342099)
Ki 3416±n/a nM
Citation Tarko, LSupuran, CT QSAR studies of sulfamate and sulfamide inhibitors targeting human carbonic anhydrase isozymes I, II, IX and XII. Bioorg Med Chem21:1404-9 (2013) 
 
Carbonic anhydrase 1
Name:Carbonic anhydrase 1
Type:Enzyme
Mol. Mass.:28873.37
Organism:Homo sapiens (Human)
Description:P00915
Residue:261
BDBM50387152
NameBDBM50387152
Synonyms:4-ureidophenyl sulfamate ring derivative 3ap | CHEMBL2047834
TypeSmall organic molecule
Emp. Form.C14H15N3O4S2
Mol. Mass.353.417
SMILESCSc1cccc(NC(=O)Nc2ccc(OS(N)(=O)=O)cc2)c1