Reaction Details
TargetCarbonic anhydrase 1
LigandBDBM50387148
Substrate/Competitorn/a
Meas. Tech.ChEMBL_946062 (CHEMBL2342099)
Ki 4503±n/a nM
Citation Tarko, LSupuran, CT QSAR studies of sulfamate and sulfamide inhibitors targeting human carbonic anhydrase isozymes I, II, IX and XII. Bioorg Med Chem21:1404-9 (2013) 
 
Carbonic anhydrase 1
Name:Carbonic anhydrase 1
Type:Enzyme
Mol. Mass.:28873.37
Organism:Homo sapiens (Human)
Description:P00915
Residue:261
BDBM50387148
NameBDBM50387148
Synonyms:4-ureidophenyl sulfamate ring derivative 3ai | CHEMBL2047828
TypeSmall organic molecule
Emp. Form.C15H17N3O5S
Mol. Mass.351.378
SMILESCCOc1ccccc1NC(=O)Nc1ccc(OS(N)(=O)=O)cc1