Reaction Details
TargetCarbonic anhydrase 1
LigandBDBM50387141
Substrate/Competitorn/a
Meas. Tech.ChEMBL_946062 (CHEMBL2342099)
Ki 8599±n/a nM
Citation Tarko, LSupuran, CT QSAR studies of sulfamate and sulfamide inhibitors targeting human carbonic anhydrase isozymes I, II, IX and XII. Bioorg Med Chem21:1404-9 (2013) 
 
Carbonic anhydrase 1
Name:Carbonic anhydrase 1
Type:Enzyme
Mol. Mass.:28873.37
Organism:Homo sapiens (Human)
Description:P00915
Residue:261
BDBM50387141
NameBDBM50387141
Synonyms:4-ureidophenyl sulfamate ring derivative 3ab | CHEMBL2047821
TypeSmall organic molecule
Emp. Form.C19H17N3O4S
Mol. Mass.383.421
SMILESNS(=O)(=O)Oc1ccc(NC(=O)Nc2ccccc2-c2ccccc2)cc1