Reaction Details
TargetCarbonic anhydrase 1
LigandBDBM50387140
Substrate/Competitorn/a
Meas. Tech.ChEMBL_946062 (CHEMBL2342099)
Ki 2713±n/a nM
Citation Tarko, LSupuran, CT QSAR studies of sulfamate and sulfamide inhibitors targeting human carbonic anhydrase isozymes I, II, IX and XII. Bioorg Med Chem21:1404-9 (2013) 
 
Carbonic anhydrase 1
Name:Carbonic anhydrase 1
Type:Enzyme
Mol. Mass.:28873.37
Organism:Homo sapiens (Human)
Description:P00915
Residue:261
BDBM50387140
NameBDBM50387140
Synonyms:4-ureidophenyl sulfamate ring derivative 3z | CHEMBL2047820
TypeSmall organic molecule
Emp. Form.C15H17N3O5S
Mol. Mass.351.378
SMILESCOc1ccc(NC(=O)Nc2ccc(OS(N)(=O)=O)cc2)c(C)c1