Reaction Details
TargetCarbonic anhydrase 1
LigandBDBM50387138
Substrate/Competitorn/a
Meas. Tech.ChEMBL_946062 (CHEMBL2342099)
Ki 4320±n/a nM
Citation Tarko, LSupuran, CT QSAR studies of sulfamate and sulfamide inhibitors targeting human carbonic anhydrase isozymes I, II, IX and XII. Bioorg Med Chem21:1404-9 (2013) 
 
Carbonic anhydrase 1
Name:Carbonic anhydrase 1
Type:Enzyme
Mol. Mass.:28873.37
Organism:Homo sapiens (Human)
Description:P00915
Residue:261
BDBM50387138
NameBDBM50387138
Synonyms:CHEMBL2047818
TypeSmall organic molecule
Emp. Form.C13H12ClN3O4S
Mol. Mass.341.77
SMILESNS(=O)(=O)Oc1ccc(NC(=O)Nc2cccc(Cl)c2)cc1