Reaction Details
TargetCarbonic anhydrase 1
LigandBDBM50387130
Substrate/Competitorn/a
Meas. Tech.ChEMBL_946062 (CHEMBL2342099)
Ki 3416±n/a nM
Citation Tarko, LSupuran, CT QSAR studies of sulfamate and sulfamide inhibitors targeting human carbonic anhydrase isozymes I, II, IX and XII. Bioorg Med Chem21:1404-9 (2013) 
 
Carbonic anhydrase 1
Name:Carbonic anhydrase 1
Type:Enzyme
Mol. Mass.:28873.37
Organism:Homo sapiens (Human)
Description:P00915
Residue:261
BDBM50387130
NameBDBM50387130
Synonyms:4-ureidophenyl sulfamate ring derivative 3o | CHEMBL2047810
TypeSmall organic molecule
Emp. Form.C13H10F3N3O4S
Mol. Mass.361.296
SMILESNS(=O)(=O)Oc1ccc(NC(=O)Nc2ccc(F)c(F)c2F)cc1