Reaction Details
TargetCarbonic anhydrase 1
LigandBDBM50387128
Substrate/Competitorn/a
Meas. Tech.ChEMBL_946062 (CHEMBL2342099)
Ki 1360±n/a nM
Citation Tarko, LSupuran, CT QSAR studies of sulfamate and sulfamide inhibitors targeting human carbonic anhydrase isozymes I, II, IX and XII. Bioorg Med Chem21:1404-9 (2013) 
 
Carbonic anhydrase 1
Name:Carbonic anhydrase 1
Type:Enzyme
Mol. Mass.:28873.37
Organism:Homo sapiens (Human)
Description:P00915
Residue:261
BDBM50387128
NameBDBM50387128
Synonyms:4-ureidophenyl sulfamate ring derivative 3m | CHEMBL2047808
TypeSmall organic molecule
Emp. Form.C13H12N4O6S
Mol. Mass.352.323
SMILESNS(=O)(=O)Oc1ccc(NC(=O)Nc2ccc(cc2)[N+]([O-])=O)cc1