Reaction Details
TargetCarbonic anhydrase 12
LigandBDBM50428618
Substrate/Competitorn/a
Meas. Tech.ChEMBL_946059 (CHEMBL2342096)
Ki 11±n/a nM
Citation Tarko, LSupuran, CT QSAR studies of sulfamate and sulfamide inhibitors targeting human carbonic anhydrase isozymes I, II, IX and XII. Bioorg Med Chem21:1404-9 (2013) 
 
Carbonic anhydrase 12
Name:Carbonic anhydrase 12
Type:Enzyme
Mol. Mass.:39456.00
Organism:Homo sapiens (Human)
Description:Catalytic domain of human cloned isozyme was used in the assay
Residue:354
BDBM50428618
NameBDBM50428618
Synonyms:CHEMBL2331756
TypeSmall organic molecule
Emp. Form.C12H14N4O4S
Mol. Mass.310.329
SMILESNS(=O)(=O)Nc1ccc(NC(=O)NCc2ccco2)cc1