Reaction Details
TargetCarbonic anhydrase 12
LigandBDBM50387130
Substrate/Competitorn/a
Meas. Tech.ChEMBL_946059 (CHEMBL2342096)
Ki 3±n/a nM
Citation Tarko, LSupuran, CT QSAR studies of sulfamate and sulfamide inhibitors targeting human carbonic anhydrase isozymes I, II, IX and XII. Bioorg Med Chem21:1404-9 (2013) 
 
Carbonic anhydrase 12
Name:Carbonic anhydrase 12
Type:Enzyme
Mol. Mass.:39456.00
Organism:Homo sapiens (Human)
Description:Catalytic domain of human cloned isozyme was used in the assay
Residue:354
BDBM50387130
NameBDBM50387130
Synonyms:4-ureidophenyl sulfamate ring derivative 3o | CHEMBL2047810
TypeSmall organic molecule
Emp. Form.C13H10F3N3O4S
Mol. Mass.361.296
SMILESNS(=O)(=O)Oc1ccc(NC(=O)Nc2ccc(F)c(F)c2F)cc1