Reaction Details
TargetCarbonic anhydrase 12
LigandBDBM50387117
Substrate/Competitorn/a
Meas. Tech.ChEMBL_946059 (CHEMBL2342096)
Ki 3±n/a nM
Citation Tarko, LSupuran, CT QSAR studies of sulfamate and sulfamide inhibitors targeting human carbonic anhydrase isozymes I, II, IX and XII. Bioorg Med Chem21:1404-9 (2013) 
 
Carbonic anhydrase 12
Name:Carbonic anhydrase 12
Type:Enzyme
Mol. Mass.:39456.00
Organism:Homo sapiens (Human)
Description:Catalytic domain of human cloned isozyme was used in the assay
Residue:354
BDBM50387117
NameBDBM50387117
Synonyms:4-ureidophenyl sulfamate ring derivative 3g | CHEMBL2047802
TypeSmall organic molecule
Emp. Form.C14H15N3O5S
Mol. Mass.337.351
SMILESCOc1ccc(NC(=O)Nc2ccc(OS(N)(=O)=O)cc2)cc1