Reaction Details
TargetCarbonic anhydrase 12
LigandBDBM50387120
Substrate/Competitorn/a
Meas. Tech.ChEMBL_946059 (CHEMBL2342096)
Ki 9±n/a nM
Citation Tarko, LSupuran, CT QSAR studies of sulfamate and sulfamide inhibitors targeting human carbonic anhydrase isozymes I, II, IX and XII. Bioorg Med Chem21:1404-9 (2013) 
 
Carbonic anhydrase 12
Name:Carbonic anhydrase 12
Type:Enzyme
Mol. Mass.:39456.00
Organism:Homo sapiens (Human)
Description:Catalytic domain of human cloned isozyme was used in the assay
Residue:354
BDBM50387120
NameBDBM50387120
Synonyms:4-ureidophenyl sulfamate ring derivative 3d | CHEMBL2047799
TypeSmall organic molecule
Emp. Form.C13H12BrN3O4S
Mol. Mass.386.221
SMILESNS(=O)(=O)Oc1ccc(NC(=O)Nc2ccc(Br)cc2)cc1