Reaction Details
TargetCarbonic anhydrase 12
LigandBDBM50387114
Substrate/Competitorn/a
Meas. Tech.ChEMBL_946059 (CHEMBL2342096)
Ki 11±n/a nM
Citation Tarko, LSupuran, CT QSAR studies of sulfamate and sulfamide inhibitors targeting human carbonic anhydrase isozymes I, II, IX and XII. Bioorg Med Chem21:1404-9 (2013) 
 
Carbonic anhydrase 12
Name:Carbonic anhydrase 12
Type:Enzyme
Mol. Mass.:39456.00
Organism:Homo sapiens (Human)
Description:Catalytic domain of human cloned isozyme was used in the assay
Residue:354
BDBM50387114
NameBDBM50387114
Synonyms:CHEMBL2047796
TypeSmall organic molecule
Emp. Form.C13H13N3O4S
Mol. Mass.307.325
SMILESNS(=O)(=O)Oc1ccc(NC(=O)Nc2ccccc2)cc1