Reaction Details
TargetCarbonic anhydrase 9
LigandBDBM50428619
Substrate/Competitorn/a
Meas. Tech.ChEMBL_946060 (CHEMBL2342097)
Ki 108±n/a nM
Citation Tarko, LSupuran, CT QSAR studies of sulfamate and sulfamide inhibitors targeting human carbonic anhydrase isozymes I, II, IX and XII. Bioorg Med Chem21:1404-9 (2013) 
 
Carbonic anhydrase 9
Name:Carbonic anhydrase 9
Type:Enzyme
Mol. Mass.:49669.03
Organism:Homo sapiens (Human)
Description:Catalytic domain of human cloned isozyme was used in the assay
Residue:459
BDBM50428619
NameBDBM50428619
Synonyms:CHEMBL2331755
TypeSmall organic molecule
Emp. Form.C16H20N4O3S
Mol. Mass.348.42
SMILESCC(C)c1ccccc1NC(=O)Nc1ccc(NS(N)(=O)=O)cc1