Reaction Details
TargetCarbonic anhydrase 9
LigandBDBM50387133
Substrate/Competitorn/a
Meas. Tech.ChEMBL_946060 (CHEMBL2342097)
Ki 17±n/a nM
Citation Tarko, LSupuran, CT QSAR studies of sulfamate and sulfamide inhibitors targeting human carbonic anhydrase isozymes I, II, IX and XII. Bioorg Med Chem21:1404-9 (2013) 
 
Carbonic anhydrase 9
Name:Carbonic anhydrase 9
Type:Enzyme
Mol. Mass.:49669.03
Organism:Homo sapiens (Human)
Description:Catalytic domain of human cloned isozyme was used in the assay
Residue:459
BDBM50387133
NameBDBM50387133
Synonyms:CHEMBL2047813
TypeSmall organic molecule
Emp. Form.C17H15N3O4S
Mol. Mass.357.384
SMILESNS(=O)(=O)Oc1ccc(NC(=O)Nc2cccc3ccccc23)cc1