Reaction Details
TargetAmine oxidase [flavin-containing] B
LigandBDBM15579
Substrate/Competitorn/a
Meas. Tech.ChEMBL_946070 (CHEMBL2342563)
IC50 20±n/a nM
Citation Desideri, NFioravanti, RProietti Monaco, LBiava, MYáñez, MOrtuso, FAlcaro, S 1,5-Diphenylpenta-2,4-dien-1-ones as potent and selective monoamine oxidase-B inhibitors. Eur J Med Chem59:91-100 (2013) 
 
Amine oxidase [flavin-containing] B
Name:Amine oxidase [flavin-containing] B
Type:Protein
Mol. Mass.:58768.76
Organism:Homo sapiens (Human)
Description:P27338
Residue:520
BDBM15579
NameBDBM15579
Synonyms:CHEMBL972 L-Deprenyl SLG US8633208, Deprenyl methyl[(2R)-1-phenylpropan-2-yl]prop-2-yn-1-ylamine
TypeSmall organic molecule
Emp. Form.C13H17N
Mol. Mass.187.2808
SMILESC[C@H](Cc1ccccc1)N(C)CC#C