Reaction Details
TargetAmine oxidase [flavin-containing] A
LigandBDBM15581
Substrate/Competitorn/a
Meas. Tech.ChEMBL_946072 (CHEMBL2342565)
IC50 4.5±n/a nM
Citation Desideri, NFioravanti, RProietti Monaco, LBiava, MYáñez, MOrtuso, FAlcaro, S 1,5-Diphenylpenta-2,4-dien-1-ones as potent and selective monoamine oxidase-B inhibitors. Eur J Med Chem59:91-100 (2013) 
 
Amine oxidase [flavin-containing] A
Name:Amine oxidase [flavin-containing] A
Type:Protein
Mol. Mass.:59689.53
Organism:Homo sapiens (Human)
Description:P21397
Residue:527
BDBM15581
NameBDBM15581
Synonyms:CHEMBL8706 CLORGILINE N-[3-(2,4-dichlorophenoxy)propyl]-N-methyl-prop-2-yn-1-amine US9603833, Clorgyline | [3-(2,4-dichlorophenoxy)propyl](methyl)prop-2-yn-1-ylamine
TypeSmall organic molecule
Emp. Form.C13H15Cl2NO
Mol. Mass.272.17
SMILESCN(CCCOc1ccc(Cl)cc1Cl)CC#C