Reaction Details
TargetLeucine-rich repeat serine/threonine-protein kinase 2
LigandBDBM50428701
Substrate/Competitorn/a
Meas. Tech.ChEMBL_947452 (CHEMBL2345528)
IC50 1.000000±n/a nM
Citation Garofalo, AWAdler, MAubele, DLBowers, SFranzini, MGoldbach, ELorentzen, CNeitz, RJProbst, GDQuinn, KPSantiago, PSham, HLTam, DTruong, APYe, XMRen, Z Novel cinnoline-based inhibitors of LRRK2 kinase activity. Bioorg Med Chem Lett23:71-4 (2012) 
 
Leucine-rich repeat serine/threonine-protein kinase 2
Name:Leucine-rich repeat serine/threonine-protein kinase 2
Type:Protein
Mol. Mass.:286113.20
Organism:Homo sapiens (Human)
Description:Q5S007
Residue:2527
BDBM50428701
NameBDBM50428701
Synonyms:CHEMBL2333115 | US9884828, 2-127
TypeSmall organic molecule
Emp. Form.C15H16N6O
Mol. Mass.296.3271
SMILESCC(C)Nc1c(nnc2ccc(cc12)-c1cn[nH]c1)C(N)=O