Reaction Details
TargetCyclin-dependent kinase 4/G1/S-specific cyclin-D1
LigandBDBM50428738
Substrate/Competitorn/a
Meas. Tech.ChEMBL_947942 (CHEMBL2344163)
IC50 1400±n/a nM
Citation Niemann, HLin, WMüller, WEKubbutat, MLai, DProksch, P Trimeric hemibastadin congener from the marine sponge Ianthella basta. J Nat Prod76:121-5 (2013) 
 
Cyclin-dependent kinase 4/G1/S-specific cyclin-D1
Name:Cyclin-dependent kinase 4/G1/S-specific cyclin-D1
Type:Protein Complex
Mol. Mass.:n/a
Description:CDK4/D1 complexes were purified from insect cells co-infected with baculovirus vectors containing each of the components.
Components:This complex has 2 components.
Component 1
Name:Cyclin-dependent kinase 4
Synonyms:CDK4 Cell division protein kinase 4 PSK-J3
Type:Enzyme Subunit
Mol. Mass.:33731.96
Organism:Homo sapiens (Human)
Description:P11802
Residue:303
Component 2
Name:G1/S-specific cyclin-D1
Synonyms:B-cell lymphoma 1 protein BCL-1 oncogene CCND1 PRAD1 | PRAD1 oncogene
Type:Enzyme Subunit
Mol. Mass.:33717.70
Organism:Homo sapiens (Human)
Description:n/a
Residue:295
BDBM50428738
NameBDBM50428738
Synonyms:CHEMBL2333163 | Sesquibastadin 1
TypeSmall organic molecule
Emp. Form.C51H44Br6N6O12
Mol. Mass.1412.352
SMILESOc1ccc(CCNC(=O)C(Cc2cc(Br)c(O)c(Oc3ccc(CCNC(=O)C(Cc4cc(Br)c(O)c(c4)-c4cc(CC(N=O)C(=O)NCCc5ccc(O)c(Br)c5)cc(Br)c4O)N=O)cc3Br)c2)N=O)cc1Br