Reaction Details
TargetAurora kinase A
LigandBDBM50150778
Substrate/Competitorn/a
Meas. Tech.ChEMBL_947947 (CHEMBL2344168)
IC50 3900±n/a nM
Citation Niemann, HLin, WMüller, WEKubbutat, MLai, DProksch, P Trimeric hemibastadin congener from the marine sponge Ianthella basta. J Nat Prod76:121-5 (2013) 
 
Aurora kinase A
Name:Aurora kinase A
Type:Serine/threonine-protein kinase
Mol. Mass.:45830.98
Organism:Homo sapiens (Human)
Description:O14965
Residue:403
BDBM50150778
NameBDBM50150778
Synonyms:Bastadin-7 CHEMBL360190 polybrominated diphenyl ether derivative
TypeSmall organic molecule
Emp. Form.C34H26Br4N4O8
Mol. Mass.938.208
SMILESOc1c(Br)cc2CCNC(=O)C(Cc3ccc(Oc4cc(CC(N=O)C(=O)NC=Cc5ccc(Oc1c2)c(Br)c5)cc(Br)c4O)c(Br)c3)N=O