Reaction Details
TargetEpidermal growth factor receptor
LigandBDBM50428740
Substrate/Competitorn/a
Meas. Tech.ChEMBL_947940 (CHEMBL2344161)
IC50 2900±n/a nM
Citation Niemann, HLin, WMüller, WEKubbutat, MLai, DProksch, P Trimeric hemibastadin congener from the marine sponge Ianthella basta. J Nat Prod76:121-5 (2013) 
 
Epidermal growth factor receptor
Name:Epidermal growth factor receptor
Type:Receptor Kinase Domain
Mol. Mass.:134279.59
Organism:Homo sapiens (Human)
Description:P00533
Residue:1210
BDBM50428740
NameBDBM50428740
Synonyms:Bastadin 16 | CHEMBL2333164
TypeSmall organic molecule
Emp. Form.C34H27Br5N4O8
Mol. Mass.1019.12
SMILESOc1ccc2CCNC(=O)C(Cc3cc(Br)c(Oc4cc(CC(N=O)C(=O)NCCc5cc(Br)c(Oc1c2)c(Br)c5)cc(Br)c4O)c(Br)c3)N=O