Reaction Details
TargetReceptor-type tyrosine-protein kinase FLT3
LigandBDBM50428738
Substrate/Competitorn/a
Meas. Tech.ChEMBL_947937 (CHEMBL2344158)
IC50 1400±n/a nM
Citation Niemann, HLin, WMüller, WEKubbutat, MLai, DProksch, P Trimeric hemibastadin congener from the marine sponge Ianthella basta. J Nat Prod76:121-5 (2013) 
 
Receptor-type tyrosine-protein kinase FLT3
Name:Receptor-type tyrosine-protein kinase FLT3
Type:Enzyme
Mol. Mass.:112888.62
Organism:Homo sapiens (Human)
Description:P36888
Residue:993
BDBM50428738
NameBDBM50428738
Synonyms:CHEMBL2333163 | Sesquibastadin 1
TypeSmall organic molecule
Emp. Form.C51H44Br6N6O12
Mol. Mass.1412.352
SMILESOc1ccc(CCNC(=O)C(Cc2cc(Br)c(O)c(Oc3ccc(CCNC(=O)C(Cc4cc(Br)c(O)c(c4)-c4cc(CC(N=O)C(=O)NCCc5ccc(O)c(Br)c5)cc(Br)c4O)N=O)cc3Br)c2)N=O)cc1Br