Reaction Details
TargetReceptor-type tyrosine-protein kinase FLT3
LigandBDBM50428737
Substrate/Competitorn/a
Meas. Tech.ChEMBL_947937 (CHEMBL2344158)
IC50 2400±n/a nM
Citation Niemann, HLin, WMüller, WEKubbutat, MLai, DProksch, P Trimeric hemibastadin congener from the marine sponge Ianthella basta. J Nat Prod76:121-5 (2013) 
 
Receptor-type tyrosine-protein kinase FLT3
Name:Receptor-type tyrosine-protein kinase FLT3
Type:Enzyme
Mol. Mass.:112888.62
Organism:Homo sapiens (Human)
Description:P36888
Residue:993
BDBM50428737
NameBDBM50428737
Synonyms:BASTADIN 3
TypeSmall organic molecule
Emp. Form.C34H30Br4N4O8
Mol. Mass.942.24
SMILESOc1ccc(CCNC(=O)C(Cc2cc(Br)c(O)c(c2)-c2cc(CC(N=O)C(=O)NCCc3ccc(O)c(Br)c3)cc(Br)c2O)N=O)cc1Br