Reaction Details
TargetAngiopoietin-1 receptor
LigandBDBM50428737
Substrate/Competitorn/a
Meas. Tech.ChEMBL_947478 (CHEMBL2345554)
IC50 800±n/a nM
Citation Niemann, HLin, WMüller, WEKubbutat, MLai, DProksch, P Trimeric hemibastadin congener from the marine sponge Ianthella basta. J Nat Prod76:121-5 (2013) 
 
Angiopoietin-1 receptor
Name:Angiopoietin-1 receptor
Type:Enzyme
Mol. Mass.:125835.70
Organism:Homo sapiens (Human)
Description:Q02763
Residue:1124
BDBM50428737
NameBDBM50428737
Synonyms:BASTADIN 3
TypeSmall organic molecule
Emp. Form.C34H30Br4N4O8
Mol. Mass.942.24
SMILESOc1ccc(CCNC(=O)C(Cc2cc(Br)c(O)c(c2)-c2cc(CC(N=O)C(=O)NCCc3ccc(O)c(Br)c3)cc(Br)c2O)N=O)cc1Br