Reaction Details
TargetAngiopoietin-1 receptor
LigandBDBM50150778
Substrate/Competitorn/a
Meas. Tech.ChEMBL_947478 (CHEMBL2345554)
IC50 1800±n/a nM
Citation Niemann, HLin, WMüller, WEKubbutat, MLai, DProksch, P Trimeric hemibastadin congener from the marine sponge Ianthella basta. J Nat Prod76:121-5 (2013) 
 
Angiopoietin-1 receptor
Name:Angiopoietin-1 receptor
Type:Enzyme
Mol. Mass.:125835.70
Organism:Homo sapiens (Human)
Description:Q02763
Residue:1124
BDBM50150778
NameBDBM50150778
Synonyms:Bastadin-7 CHEMBL360190 polybrominated diphenyl ether derivative
TypeSmall organic molecule
Emp. Form.C34H26Br4N4O8
Mol. Mass.938.208
SMILESOc1c(Br)cc2CCNC(=O)C(Cc3ccc(Oc4cc(CC(N=O)C(=O)NC=Cc5ccc(Oc1c2)c(Br)c5)cc(Br)c4O)c(Br)c3)N=O