Reaction Details
TargetSodium-dependent serotonin transporter
LigandBDBM50428783
Substrate/Competitorn/a
Meas. Tech.ChEMBL_948439 (CHEMBL2342729)
IC50 3.1±n/a nM
Citation Gillman, KWParker, MFSilva, MDegnan, APTora, GOLodge, NJLi, YWLelas, STaber, MKrause, RGBertekap, RLNewton, AEPieschl, RLLengyel, KDJohnson, KATaylor, SJBronson, JJMacor, JE Design, optimization, and in vivo evaluation of a series of pyridine derivatives with dual NK1 antagonism and SERT inhibition for the treatment of depression. Bioorg Med Chem Lett23:407-11 (2012) 
 
Sodium-dependent serotonin transporter
Name:Sodium-dependent serotonin transporter
Type:Multi-pass membrane protein
Mol. Mass.:70322.51
Organism:Homo sapiens (Human)
Description:P31645
Residue:630
BDBM50428783
NameBDBM50428783
Synonyms:CHEMBL2333646
TypeSmall organic molecule
Emp. Form.C19H23BrN2O
Mol. Mass.375.303
SMILESCN1CCC(COCc2cncc(Br)c2)(CC1)c1ccccc1