Reaction Details
TargetSodium-dependent serotonin transporter
LigandBDBM50428786
Substrate/Competitorn/a
Meas. Tech.ChEMBL_948439 (CHEMBL2342729)
IC50 4.3±n/a nM
Citation Gillman, KWParker, MFSilva, MDegnan, APTora, GOLodge, NJLi, YWLelas, STaber, MKrause, RGBertekap, RLNewton, AEPieschl, RLLengyel, KDJohnson, KATaylor, SJBronson, JJMacor, JE Design, optimization, and in vivo evaluation of a series of pyridine derivatives with dual NK1 antagonism and SERT inhibition for the treatment of depression. Bioorg Med Chem Lett23:407-11 (2012) 
 
Sodium-dependent serotonin transporter
Name:Sodium-dependent serotonin transporter
Type:Multi-pass membrane protein
Mol. Mass.:70322.51
Organism:Homo sapiens (Human)
Description:P31645
Residue:630
BDBM50428786
NameBDBM50428786
Synonyms:CHEMBL2333643
TypeSmall organic molecule
Emp. Form.C20H21ClF4N2O
Mol. Mass.416.84
SMILESCN1CCC(COCc2cc(cc(Cl)n2)C(F)(F)F)(CC1)c1ccc(F)cc1