Reaction Details
TargetSubstance-P receptor
LigandBDBM50428758
Substrate/Competitorn/a
Meas. Tech.ChEMBL_948440 (CHEMBL2342730)
IC50 2.0±n/a nM
Citation Gillman, KWParker, MFSilva, MDegnan, APTora, GOLodge, NJLi, YWLelas, STaber, MKrause, RGBertekap, RLNewton, AEPieschl, RLLengyel, KDJohnson, KATaylor, SJBronson, JJMacor, JE Design, optimization, and in vivo evaluation of a series of pyridine derivatives with dual NK1 antagonism and SERT inhibition for the treatment of depression. Bioorg Med Chem Lett23:407-11 (2012) 
 
Substance-P receptor
Name:Substance-P receptor
Type:G Protein-Coupled Receptor (GPCR)
Mol. Mass.:46254.43
Organism:Homo sapiens (Human)
Description:P25103
Residue:407
BDBM50428758
NameBDBM50428758
Synonyms:CHEMBL2333605
TypeSmall organic molecule
Emp. Form.C22H25F3N2O
Mol. Mass.390.4419
SMILESFC(F)(F)c1cc(COCC2(CCNCC2)c2ccccc2)nc(c1)C1CC1