Reaction Details
TargetSubstance-P receptor
LigandBDBM50428774
Substrate/Competitorn/a
Meas. Tech.ChEMBL_948440 (CHEMBL2342730)
IC50 2.7±n/a nM
Citation Gillman, KWParker, MFSilva, MDegnan, APTora, GOLodge, NJLi, YWLelas, STaber, MKrause, RGBertekap, RLNewton, AEPieschl, RLLengyel, KDJohnson, KATaylor, SJBronson, JJMacor, JE Design, optimization, and in vivo evaluation of a series of pyridine derivatives with dual NK1 antagonism and SERT inhibition for the treatment of depression. Bioorg Med Chem Lett23:407-11 (2012) 
 
Substance-P receptor
Name:Substance-P receptor
Type:G Protein-Coupled Receptor (GPCR)
Mol. Mass.:46254.43
Organism:Homo sapiens (Human)
Description:P25103
Residue:407
BDBM50428774
NameBDBM50428774
Synonyms:CHEMBL2333623
TypeSmall organic molecule
Emp. Form.C23H28F3N3O
Mol. Mass.419.4831
SMILESFC(F)(F)c1cc(COCC2(CCNCC2)c2ccccc2)nc(c1)N1CCCC1