Reaction Details
TargetSodium-dependent serotonin transporter
LigandBDBM50428774
Substrate/Competitorn/a
Meas. Tech.ChEMBL_948439 (CHEMBL2342729)
IC50 58±n/a nM
Citation Gillman, KWParker, MFSilva, MDegnan, APTora, GOLodge, NJLi, YWLelas, STaber, MKrause, RGBertekap, RLNewton, AEPieschl, RLLengyel, KDJohnson, KATaylor, SJBronson, JJMacor, JE Design, optimization, and in vivo evaluation of a series of pyridine derivatives with dual NK1 antagonism and SERT inhibition for the treatment of depression. Bioorg Med Chem Lett23:407-11 (2012) 
 
Sodium-dependent serotonin transporter
Name:Sodium-dependent serotonin transporter
Type:Multi-pass membrane protein
Mol. Mass.:70322.51
Organism:Homo sapiens (Human)
Description:P31645
Residue:630
BDBM50428774
NameBDBM50428774
Synonyms:CHEMBL2333623
TypeSmall organic molecule
Emp. Form.C23H28F3N3O
Mol. Mass.419.4831
SMILESFC(F)(F)c1cc(COCC2(CCNCC2)c2ccccc2)nc(c1)N1CCCC1