Reaction Details
TargetPeroxisome proliferator-activated receptor gamma
LigandBDBM28701
Substrate/Competitorn/a
Meas. Tech.ChEMBL_948911 (CHEMBL2341205)
EC50 70360±n/a nM
Citation Matin, ADoddareddy, MRGavande, NNammi, SGroundwater, PWRoubin, RHHibbs, DE The discovery of novel isoflavone pan peroxisome proliferator-activated receptor agonists. Bioorg Med Chem21:766-78 (2013) 
 
Peroxisome proliferator-activated receptor gamma
Name:Peroxisome proliferator-activated receptor gamma
Type:Nuclear Receptor
Mol. Mass.:57613.46
Organism:Homo sapiens (Human)
Description:P37231
Residue:505
BDBM28701
NameBDBM28701
Synonyms:2-(4-{2-[(4-chlorophenyl)formamido]ethyl}phenoxy)-2-methylpropanoic acid Bezafibrate Cedur | Sklerofibrat
TypeSmall organic molecule
Emp. Form.C19H20ClNO4
Mol. Mass.361.819
SMILESCC(C)(Oc1ccc(CCNC(=O)c2ccc(Cl)cc2)cc1)C(O)=O