Reaction Details
TargetUDP-N-acetylglucosamine 1-carboxyvinyltransferase
LigandBDBM50428793
Substrate/Competitorn/a
Meas. Tech.ChEMBL_949339 (CHEMBL2339337)
IC50 4600±n/a nM
Citation Scholz, THeyl, CLBernardi, DZimmermann, SKattner, LKlein, CD Chemical, biochemical and microbiological properties of a brominated nitrovinylfuran with broad-spectrum antibacterial activity. Bioorg Med Chem21:795-804 (2013) 
 
UDP-N-acetylglucosamine 1-carboxyvinyltransferase
Name:UDP-N-acetylglucosamine 1-carboxyvinyltransferase
Type:Protein
Mol. Mass.:44814.62
Organism:Escherichia coli K-12 (Enterobacteria)
Description:E. coli MurA
Residue:419
BDBM50428793
NameBDBM50428793
Synonyms:Bromo(Nitro)Methane | CHEMBL2335229
TypeSmall organic molecule
Emp. Form.CH2BrNO2
Mol. Mass.139.936
SMILES[O-][N+](=O)CBr