Reaction Details
TargetCarbonic anhydrase 14
LigandBDBM50428800
Substrate/Competitorn/a
Meas. Tech.ChEMBL_949340 (CHEMBL2339338)
Ki 8370±n/a nM
Citation Gavernet, LGonzalez Funes, JLPalestro, PHBruno Blanch, LEEstiu, GLMaresca, ABarrios, ISupuran, CT Inhibition pattern of sulfamide-related compounds in binding to carbonic anhydrase isoforms I, II, VII, XII and XIV. Bioorg Med Chem21:1410-8 (2013) 
 
Carbonic anhydrase 14
Name:Carbonic anhydrase 14
Type:Enzyme
Mol. Mass.:37665.67
Organism:Homo sapiens (Human)
Description:Human (cloned) isozyme.
Residue:337
BDBM50428800
NameBDBM50428800
Synonyms:CHEMBL199831 | Methyl 3-(Butylsulfamoylamino)Propanoate
TypeSmall organic molecule
Emp. Form.C8H18N2O4S
Mol. Mass.238.305
SMILESCCCCNS(=O)(=O)NCCC(=O)OC