Reaction Details
TargetCarbonic anhydrase 14
LigandBDBM50428801
Substrate/Competitorn/a
Meas. Tech.ChEMBL_949340 (CHEMBL2339338)
Ki 7970±n/a nM
Citation Gavernet, LGonzalez Funes, JLPalestro, PHBruno Blanch, LEEstiu, GLMaresca, ABarrios, ISupuran, CT Inhibition pattern of sulfamide-related compounds in binding to carbonic anhydrase isoforms I, II, VII, XII and XIV. Bioorg Med Chem21:1410-8 (2013) 
 
Carbonic anhydrase 14
Name:Carbonic anhydrase 14
Type:Enzyme
Mol. Mass.:37665.67
Organism:Homo sapiens (Human)
Description:Human (cloned) isozyme.
Residue:337
BDBM50428801
NameBDBM50428801
Synonyms:CHEMBL471637
TypeSmall organic molecule
Emp. Form.C12H24N2O6S
Mol. Mass.324.394
SMILESCOC(=O)[C@@H](NS(=O)(=O)N[C@@H](C(C)C)C(=O)OC)C(C)C