Reaction Details
TargetCarbonic anhydrase 14
LigandBDBM50428814
Substrate/Competitorn/a
Meas. Tech.ChEMBL_949340 (CHEMBL2339338)
Ki 40400±n/a nM
Citation Gavernet, LGonzalez Funes, JLPalestro, PHBruno Blanch, LEEstiu, GLMaresca, ABarrios, ISupuran, CT Inhibition pattern of sulfamide-related compounds in binding to carbonic anhydrase isoforms I, II, VII, XII and XIV. Bioorg Med Chem21:1410-8 (2013) 
 
Carbonic anhydrase 14
Name:Carbonic anhydrase 14
Type:Enzyme
Mol. Mass.:37665.67
Organism:Homo sapiens (Human)
Description:Human (cloned) isozyme.
Residue:337
BDBM50428814
NameBDBM50428814
Synonyms:CHEMBL229904
TypeSmall organic molecule
Emp. Form.C12H18N2O4S
Mol. Mass.286.347
SMILESCC(C)(C)OC(=O)NS(=O)(=O)NCc1ccccc1