Reaction Details
TargetCarbonic anhydrase 14
LigandBDBM50428815
Substrate/Competitorn/a
Meas. Tech.ChEMBL_949340 (CHEMBL2339338)
Ki 7100±n/a nM
Citation Gavernet, LGonzalez Funes, JLPalestro, PHBruno Blanch, LEEstiu, GLMaresca, ABarrios, ISupuran, CT Inhibition pattern of sulfamide-related compounds in binding to carbonic anhydrase isoforms I, II, VII, XII and XIV. Bioorg Med Chem21:1410-8 (2013) 
 
Carbonic anhydrase 14
Name:Carbonic anhydrase 14
Type:Enzyme
Mol. Mass.:37665.67
Organism:Homo sapiens (Human)
Description:Human (cloned) isozyme.
Residue:337
BDBM50428815
NameBDBM50428815
Synonyms:1-[Propyl(Sulfamoyl)Amino]Propane N,N-Dipropylsulfamide
TypeSmall organic molecule
Emp. Form.C6H16N2O2S
Mol. Mass.180.268
SMILESCCCN(CCC)S(N)(=O)=O