Reaction Details
TargetCarbonic anhydrase 12
LigandBDBM50428801
Substrate/Competitorn/a
Meas. Tech.ChEMBL_949341 (CHEMBL2339339)
Ki 73000±n/a nM
Citation Gavernet, LGonzalez Funes, JLPalestro, PHBruno Blanch, LEEstiu, GLMaresca, ABarrios, ISupuran, CT Inhibition pattern of sulfamide-related compounds in binding to carbonic anhydrase isoforms I, II, VII, XII and XIV. Bioorg Med Chem21:1410-8 (2013) 
 
Carbonic anhydrase 12
Name:Carbonic anhydrase 12
Type:Enzyme
Mol. Mass.:39456.00
Organism:Homo sapiens (Human)
Description:Catalytic domain of human cloned isozyme was used in the assay
Residue:354
BDBM50428801
NameBDBM50428801
Synonyms:CHEMBL471637
TypeSmall organic molecule
Emp. Form.C12H24N2O6S
Mol. Mass.324.394
SMILESCOC(=O)[C@@H](NS(=O)(=O)N[C@@H](C(C)C)C(=O)OC)C(C)C