Reaction Details
TargetCarbonic anhydrase 12
LigandBDBM50428804
Substrate/Competitorn/a
Meas. Tech.ChEMBL_949341 (CHEMBL2339339)
Ki>200000±n/a nM
Citation Gavernet, LGonzalez Funes, JLPalestro, PHBruno Blanch, LEEstiu, GLMaresca, ABarrios, ISupuran, CT Inhibition pattern of sulfamide-related compounds in binding to carbonic anhydrase isoforms I, II, VII, XII and XIV. Bioorg Med Chem21:1410-8 (2013) 
 
Carbonic anhydrase 12
Name:Carbonic anhydrase 12
Type:Enzyme
Mol. Mass.:39456.00
Organism:Homo sapiens (Human)
Description:Catalytic domain of human cloned isozyme was used in the assay
Residue:354
BDBM50428804
NameBDBM50428804
Synonyms:CHEMBL229902 | N,N,N'',N''-Tetrabutylsulfamide
TypeSmall organic molecule
Emp. Form.C16H36N2O2S
Mol. Mass.320.534
SMILESCCCCN(CCCC)S(=O)(=O)N(CCCC)CCCC