Reaction Details
TargetCarbonic anhydrase 7
LigandBDBM50428807
Substrate/Competitorn/a
Meas. Tech.ChEMBL_949342 (CHEMBL2339340)
Ki 320±n/a nM
Citation Gavernet, LGonzalez Funes, JLPalestro, PHBruno Blanch, LEEstiu, GLMaresca, ABarrios, ISupuran, CT Inhibition pattern of sulfamide-related compounds in binding to carbonic anhydrase isoforms I, II, VII, XII and XIV. Bioorg Med Chem21:1410-8 (2013) 
 
Carbonic anhydrase 7
Name:Carbonic anhydrase 7
Type:Enzyme
Mol. Mass.:29664.11
Organism:Homo sapiens (Human)
Description:Human cloned isozyme.
Residue:264
BDBM50428807
NameBDBM50428807
Synonyms:CHEMBL388325 N-Cyclohexyl(Cyclohexylamino)Sulfonamide
TypeSmall organic molecule
Emp. Form.C12H24N2O2S
Mol. Mass.260.396
SMILESO=S(=O)(NC1CCCCC1)NC1CCCCC1